BDBM50323798 CHEMBL1214336::N-[5-(3-pyridinyl)-2,3-dihydro-1H-inden-2-yl]-2-propanesulfonamide
SMILES CC(C)S(=O)(=O)NC1Cc2ccc(cc2C1)-c1cccnc1
InChI Key InChIKey=JYFFQMUEOPGGBU-UHFFFAOYSA-N
Data  5 IC50
  Tab Delimited (TSV)   2D SDfile   Computed 3D by Vconf -m prep SDfile
Find this compound or compounds like it in BindingDB:
Activity Spreadsheet -- Enzyme Inhibition Constant Data from BindingDB
Found 1 hit for monomerid = 50323798
TargetCytochrome P450 2C9(Homo sapiens (Human))
Glaxosmithkline
Curated by ChEMBL
LigandPNGBDBM50323798(CHEMBL1214336 | N-[5-(3-pyridinyl)-2,3-dihydro-1H-...)
Affinity DataIC50: >1.00E+4nM. Assay description: Inhibition of human CYP2C9 after 10 mins
In DepthDetails ArticlePubMed